Reaction Details
Target5-hydroxytryptamine receptor 6
LigandBDBM50223306
Substrate/Competitorn/a
Meas. Tech.ChEMBL_458154 (CHEMBL924411)
Ki 19±n/a nM
Citation Tasler, SKraus, JWuzik, AMüller, OAschenbrenner, ACubero, EPascual, RQuintana-Ruiz, JRDordal, AMercè, RCodony, X Discovery of 5-HT6 receptor ligands based on virtual HTS. Bioorg Med Chem Lett17:6224-9 (2007) 
 
5-hydroxytryptamine receptor 6
Name:5-hydroxytryptamine receptor 6
Type:G Protein-Coupled Receptor (GPCR)
Mol. Mass.:46968.43
Organism:Homo sapiens (Human)
Description:P50406
Residue:440
BDBM50223306
NameBDBM50223306
Synonyms:CHEMBL248658 | N-(2-(2-methoxyphenoxy)ethyl)-5-(4-methylpiperazin-1-yl)-2-nitrobenzenamine
TypeSmall organic molecule
Emp. Form.C20H26N4O4
Mol. Mass.386.4448
SMILESCOc1ccccc1OCCNc1cc(ccc1[N+]([O-])=O)N1CCN(C)CC1