Reaction Details
TargetSerine/threonine-protein kinase Chk1
LigandBDBM50223452
Substrate/Competitorn/a
Meas. Tech.ChEMBL_458175 (CHEMBL924433)
IC50 2±n/a nM
Citation Garbaccio, RMHuang, STasber, ESFraley, MEYan, YMunshi, SIkuta, MKuo, LKreatsoulas, CStirdivant, SDrakas, BRickert, KWalsh, ESHamilton, KABuser, CAHardwick, JMao, XBeck, SCAbrams, MTTao, WLobell, RSepp-Lorenzino, LHartman, GD Synthesis and evaluation of substituted benzoisoquinolinones as potent inhibitors of Chk1 kinase. Bioorg Med Chem Lett17:6280-5 (2007) 
 
Serine/threonine-protein kinase Chk1
Name:Serine/threonine-protein kinase Chk1
Type:Enzyme Catalytic Domain
Mol. Mass.:54443.02
Organism:Homo sapiens (Human)
Description:gi_166295192
Residue:476
BDBM50223452
NameBDBM50223452
Synonyms:6-(3-aminopropyl)-4-(2-hydroxyphenyl)-9-(1H-pyrazol-4-yl)benzo[h]isoquinolin-1(2H)-one | CHEMBL249241
TypeSmall organic molecule
Emp. Form.C25H22N4O2
Mol. Mass.410.4678
SMILESNCCCc1cc2c(c[nH]c(=O)c2c2cc(ccc12)-c1cn[nH]c1)-c1ccccc1O