Reaction Details
TargetHistone deacetylase 4
LigandBDBM50223506
Substrate/Competitorn/a
Meas. Tech.ChEMBL_461212 (CHEMBL926151)
IC50 24±n/a nM
Citation Nishino, NShivashimpi, GMSoni, PBBhuiyan, MPKato, TMaeda, SNishino, TGYoshida, M Interaction of aliphatic cap group in inhibition of histone deacetylases by cyclic tetrapeptides. Bioorg Med Chem16:437-45 (2008) 
 
Histone deacetylase 4
Name:Histone deacetylase 4
Type:Enzyme
Mol. Mass.:119049.39
Organism:Homo sapiens (Human)
Description:P56524
Residue:1084
BDBM50223506
NameBDBM50223506
Synonyms:(5S,11S,13aR)-5-butyl-8,8-dimethyl-11-[5-(pyridin-2-yldisulfanyl)-pentyl]-decahydro-3a,6,9,12-tetraaza-cyclopentacyclododecene-4,7,10,13-tetraone | CHEMBL401837
TypeSmall organic molecule
Emp. Form.C27H41N5O4S2
Mol. Mass.563.776
SMILESCCCC[C@@H]1NC(=O)C(C)(C)NC(=O)[C@H](CCCCCSSc2ccccn2)NC(=O)[C@H]2CCCN2C1=O