Reaction Details
TargetHistone deacetylase 1
LigandBDBM19130
Substrate/Competitorn/a
Meas. Tech.ChEMBL_461211 (CHEMBL926150)
IC50 190±n/a nM
Citation Nishino, NShivashimpi, GMSoni, PBBhuiyan, MPKato, TMaeda, SNishino, TGYoshida, M Interaction of aliphatic cap group in inhibition of histone deacetylases by cyclic tetrapeptides. Bioorg Med Chem16:437-45 (2008) 
 
Histone deacetylase 1
Name:Histone deacetylase 1
Type:Enzyme
Mol. Mass.:55090.27
Organism:Homo sapiens (Human)
Description:Q13547
Residue:482
BDBM19130
NameBDBM19130
Synonyms:(2E,4E,6R)-7-[4-(dimethylamino)phenyl]-N-hydroxy-4,6-dimethyl-7-oxohepta-2,4-dienamide TSA | Trichostatin A (TSA)
TypeSmall organic molecule
Emp. Form.C17H22N2O3
Mol. Mass.302.3682
SMILESCC(C=CC(=O)NO)C=C(C)C(=O)c1ccc(cc1)N(C)C