Reaction Details
TargetAlpha-1A adrenergic receptor
LigandBDBM50223565
Substrate/Competitorn/a
Meas. Tech.ChEMBL_450222 (CHEMBL900497)
Ki 1.2±n/a nM
Citation Chiu, GLi, SCai, HConnolly, PJPeng, SStauber, KPulito, VLiu, JMiddleton, SA Aminocyclohexylsulfonamides: discovery of metabolically stable alpha(1a/1d)-selective adrenergic receptor antagonists for the treatment of benign prostatic hyperplasia/lower urinary tract symptoms (BPH/LUTS). Bioorg Med Chem Lett17:6123-8 (2007) 
 
Alpha-1A adrenergic receptor
Name:Alpha-1A adrenergic receptor
Type:Cell-surface receptors
Mol. Mass.:51511.67
Organism:Homo sapiens (Human)
Description:P35348
Residue:466
BDBM50223565
NameBDBM50223565
Synonyms:3,4-dimethoxy-N-((1s,4s)-4-(4-(2-(2,2,2-trifluoroethoxy)phenyl)piperazin-1-yl)cyclohexyl)benzenesulfonamide | CHEMBL438673
TypeSmall organic molecule
Emp. Form.C26H34F3N3O5S
Mol. Mass.557.625
SMILESCOc1ccc(cc1OC)S(=O)(=O)N[C@H]1CC[C@H](CC1)N1CCN(CC1)c1ccccc1OCC(F)(F)F