Reaction Details
TargetThymidylate kinase
LigandBDBM50223803
Substrate/Competitorn/a
Meas. Tech.ChEMBL_450257 (CHEMBL900534)
Ki 35000±n/a nM
Citation Van Daele, IMunier-Lehmann, HFroeyen, MBalzarini, JVan Calenbergh, S Rational design of 5'-thiourea-substituted alpha-thymidine analogues as thymidine monophosphate kinase inhibitors capable of inhibiting mycobacterial growth. J Med Chem50:5281-92 (2007) 
 
Thymidylate kinase
Name:Thymidylate kinase
Type:PROTEIN
Mol. Mass.:22636.29
Organism:Mycobacterium tuberculosis
Description:ChEMBL_208218
Residue:214
BDBM50223803
NameBDBM50223803
Synonyms:5'-benzoylamino-5'-deoxy-alpha-D-thymidine | CHEMBL235093
TypeSmall organic molecule
Emp. Form.C17H19N3O5
Mol. Mass.345.3499
SMILESCc1cn([C@@H]2C[C@H](O)[C@@H](CNC(=O)c3ccccc3)O2)c(=O)[nH]c1=O