Reaction Details
TargetThymidylate kinase
LigandBDBM50223808
Substrate/Competitorn/a
Meas. Tech.ChEMBL_450257 (CHEMBL900534)
Ki 21000±n/a nM
Citation Van Daele, IMunier-Lehmann, HFroeyen, MBalzarini, JVan Calenbergh, S Rational design of 5'-thiourea-substituted alpha-thymidine analogues as thymidine monophosphate kinase inhibitors capable of inhibiting mycobacterial growth. J Med Chem50:5281-92 (2007) 
 
Thymidylate kinase
Name:Thymidylate kinase
Type:PROTEIN
Mol. Mass.:22636.29
Organism:Mycobacterium tuberculosis
Description:ChEMBL_208218
Residue:214
BDBM50223808
NameBDBM50223808
Synonyms:CHEMBL235478 | N-(4-chlorophenyl)-N'-[(3'-deoxythymidin-3'-yl)methyl]thiourea
TypeSmall organic molecule
Emp. Form.C18H21ClN4O4S
Mol. Mass.424.902
SMILESCc1cn([C@H]2C[C@H](CNC(=S)Nc3ccc(Cl)cc3)[C@@H](CO)O2)c(=O)[nH]c1=O