Reaction Details
TargetThymidylate kinase
LigandBDBM50223806
Substrate/Competitorn/a
Meas. Tech.ChEMBL_450257 (CHEMBL900534)
Ki 600±n/a nM
Citation Van Daele, IMunier-Lehmann, HFroeyen, MBalzarini, JVan Calenbergh, S Rational design of 5'-thiourea-substituted alpha-thymidine analogues as thymidine monophosphate kinase inhibitors capable of inhibiting mycobacterial growth. J Med Chem50:5281-92 (2007) 
 
Thymidylate kinase
Name:Thymidylate kinase
Type:PROTEIN
Mol. Mass.:22636.29
Organism:Mycobacterium tuberculosis
Description:ChEMBL_208218
Residue:214
BDBM50223806
NameBDBM50223806
Synonyms:CHEMBL392137 | N-(5'-deoxy-alpha-D-thymidin-5'-yl)-N'-(3-trifluoromethyl-4-chlorophenyl)thiourea
TypeSmall organic molecule
Emp. Form.C18H18ClF3N4O4S
Mol. Mass.478.873
SMILESCc1cn([C@@H]2C[C@H](O)[C@@H](CNC(=S)Nc3ccc(Cl)c(c3)C(F)(F)F)O2)c(=O)[nH]c1=O