Reaction Details
TargetThymidylate kinase
LigandBDBM50223811
Substrate/Competitorn/a
Meas. Tech.ChEMBL_450257 (CHEMBL900534)
Ki 7200±n/a nM
Citation Van Daele, IMunier-Lehmann, HFroeyen, MBalzarini, JVan Calenbergh, S Rational design of 5'-thiourea-substituted alpha-thymidine analogues as thymidine monophosphate kinase inhibitors capable of inhibiting mycobacterial growth. J Med Chem50:5281-92 (2007) 
 
Thymidylate kinase
Name:Thymidylate kinase
Type:PROTEIN
Mol. Mass.:22636.29
Organism:Mycobacterium tuberculosis
Description:ChEMBL_208218
Residue:214
BDBM50223811
NameBDBM50223811
Synonyms:CHEMBL235686 | N-(3,4-dichlorophenyl)-N'-[(3'-deoxythymidin-3'-yl)methyl]thiourea
TypeSmall organic molecule
Emp. Form.C18H20Cl2N4O4S
Mol. Mass.459.347
SMILESCc1cn([C@H]2C[C@H](CNC(=S)Nc3ccc(Cl)c(Cl)c3)[C@@H](CO)O2)c(=O)[nH]c1=O