Reaction Details
TargetThymidylate kinase
LigandBDBM50223815
Substrate/Competitorn/a
Meas. Tech.ChEMBL_450257 (CHEMBL900534)
Ki 2200±n/a nM
Citation Van Daele, IMunier-Lehmann, HFroeyen, MBalzarini, JVan Calenbergh, S Rational design of 5'-thiourea-substituted alpha-thymidine analogues as thymidine monophosphate kinase inhibitors capable of inhibiting mycobacterial growth. J Med Chem50:5281-92 (2007) 
 
Thymidylate kinase
Name:Thymidylate kinase
Type:PROTEIN
Mol. Mass.:22636.29
Organism:Mycobacterium tuberculosis
Description:ChEMBL_208218
Residue:214
BDBM50223815
NameBDBM50223815
Synonyms:CHEMBL393932 | N-(3,4-dichlorophenethyl)-N'-(5'-deoxy-alpha-D-thymidin-5'-yl)thiourea
TypeSmall organic molecule
Emp. Form.C19H22Cl2N4O4S
Mol. Mass.473.373
SMILESCc1cn([C@@H]2C[C@H](O)[C@@H](CNC(=S)NCCc3ccc(Cl)c(Cl)c3)O2)c(=O)[nH]c1=O