Reaction Details
TargetThymidylate kinase
LigandBDBM50223813
Substrate/Competitorn/a
Meas. Tech.ChEMBL_450257 (CHEMBL900534)
Ki 2300±n/a nM
Citation Van Daele, IMunier-Lehmann, HFroeyen, MBalzarini, JVan Calenbergh, S Rational design of 5'-thiourea-substituted alpha-thymidine analogues as thymidine monophosphate kinase inhibitors capable of inhibiting mycobacterial growth. J Med Chem50:5281-92 (2007) 
 
Thymidylate kinase
Name:Thymidylate kinase
Type:PROTEIN
Mol. Mass.:22636.29
Organism:Mycobacterium tuberculosis
Description:ChEMBL_208218
Residue:214
BDBM50223813
NameBDBM50223813
Synonyms:CHEMBL236973 | N-(3-trifluoromethyl-4-chlorophenyl)-N'-(3',5'-dideoxy-alpha-D-thymidin-5'-yl)thiourea
TypeSmall organic molecule
Emp. Form.C18H18ClF3N4O3S
Mol. Mass.462.874
SMILESCc1cn([C@@H]2CC[C@@H](CNC(=S)Nc3ccc(Cl)c(c3)C(F)(F)F)O2)c(=O)[nH]c1=O