Reaction Details
TargetThymidylate kinase
LigandBDBM50223821
Substrate/Competitorn/a
Meas. Tech.ChEMBL_450257 (CHEMBL900534)
Ki 260000±n/a nM
Citation Van Daele, IMunier-Lehmann, HFroeyen, MBalzarini, JVan Calenbergh, S Rational design of 5'-thiourea-substituted alpha-thymidine analogues as thymidine monophosphate kinase inhibitors capable of inhibiting mycobacterial growth. J Med Chem50:5281-92 (2007) 
 
Thymidylate kinase
Name:Thymidylate kinase
Type:PROTEIN
Mol. Mass.:22636.29
Organism:Mycobacterium tuberculosis
Description:ChEMBL_208218
Residue:214
BDBM50223821
NameBDBM50223821
Synonyms:CHEMBL235304 | N-[(thymin-1-yl)methoxyethyl]-N'-phenylthiourea
TypeSmall organic molecule
Emp. Form.C15H18N4O3S
Mol. Mass.334.393
SMILESCc1cn(COCCNC(=S)Nc2ccccc2)c(=O)[nH]c1=O