Reaction Details
TargetCathepsin S
LigandBDBM50223930
Substrate/Competitorn/a
Meas. Tech.ChEMBL_458258 (CHEMBL924504)
IC50 220±n/a nM
Citation Teno, NMiyake, TEhara, TIrie, OSakaki, JOhmori, OGunji, HMatsuura, NMasuya, KHitomi, YNonomura, KHoriuchi, MGohda, KIwasaki, AUmemura, ITada, SKometani, MIwasaki, GCowan-Jacob, SWMissbach, MLattmann, RBetschart, C Novel scaffold for cathepsin K inhibitors. Bioorg Med Chem Lett17:6096-100 (2007) 
 
Cathepsin S
Name:Cathepsin S
Type:Protein
Mol. Mass.:37507.38
Organism:Homo sapiens (Human)
Description:P25774
Residue:331
BDBM50223930
NameBDBM50223930
Synonyms:CHEMBL251187 | N-{4-[(2-cyano-7-neopentyl-7H-pyrrolo[2,3-d]pyrimidin-6-yl)methyl]phenyl}sulfamide
TypeSmall organic molecule
Emp. Form.C19H22N6O2S
Mol. Mass.398.482
SMILESCC(C)(C)Cn1c(Cc2ccc(NS(N)(=O)=O)cc2)cc2cnc(nc12)C#N