Reaction Details
TargetCathepsin K
LigandBDBM50223921
Substrate/Competitorn/a
Meas. Tech.ChEMBL_458256 (CHEMBL924502)
IC50 1.1±n/a nM
Citation Teno, NMiyake, TEhara, TIrie, OSakaki, JOhmori, OGunji, HMatsuura, NMasuya, KHitomi, YNonomura, KHoriuchi, MGohda, KIwasaki, AUmemura, ITada, SKometani, MIwasaki, GCowan-Jacob, SWMissbach, MLattmann, RBetschart, C Novel scaffold for cathepsin K inhibitors. Bioorg Med Chem Lett17:6096-100 (2007) 
 
Cathepsin K
Name:Cathepsin K
Type:Enzyme
Mol. Mass.:36975.68
Organism:Homo sapiens (Human)
Description:P43235
Residue:329
BDBM50223921
NameBDBM50223921
Synonyms:6-(4-(benzo[d][1,3]dioxol-5-yl)benzyl)-7-neopentyl-7H-pyrrolo[2,3-d]pyrimidine-2-carbonitrile | CHEMBL250591
TypeSmall organic molecule
Emp. Form.C26H24N4O2
Mol. Mass.424.4944
SMILESCC(C)(C)Cn1c(Cc2ccc(cc2)-c2ccc3OCOc3c2)cc2cnc(nc12)C#N