Reaction Details
TargetCathepsin K
LigandBDBM50223911
Substrate/Competitorn/a
Meas. Tech.ChEMBL_458256 (CHEMBL924502)
IC50 3±n/a nM
Citation Teno, NMiyake, TEhara, TIrie, OSakaki, JOhmori, OGunji, HMatsuura, NMasuya, KHitomi, YNonomura, KHoriuchi, MGohda, KIwasaki, AUmemura, ITada, SKometani, MIwasaki, GCowan-Jacob, SWMissbach, MLattmann, RBetschart, C Novel scaffold for cathepsin K inhibitors. Bioorg Med Chem Lett17:6096-100 (2007) 
 
Cathepsin K
Name:Cathepsin K
Type:Enzyme
Mol. Mass.:36975.68
Organism:Homo sapiens (Human)
Description:P43235
Residue:329
BDBM50223911
NameBDBM50223911
Synonyms:7-neopentyl-6-((pyridin-4-yloxy)methyl)-7H-pyrrolo[2,3-d]pyrimidine-2-carbonitrile | CHEMBL249758
TypeSmall organic molecule
Emp. Form.C18H19N5O
Mol. Mass.321.3764
SMILESCC(C)(C)Cn1c(COc2ccncc2)cc2cnc(nc12)C#N