Reaction Details
TargetMuscarinic acetylcholine receptor M3
LigandBDBM50223990
Substrate/Competitorn/a
Meas. Tech.ChEMBL_450373 (CHEMBL900657)
IC50 2.3±n/a nM
Citation Lainé, DIXie, HBuffet, NFoley, JJBuckley, PWebb, EFWiddowson, KLPalovich, MRBelmonte, KE Discovery of novel 8-azoniabicyclo[3.2.1]octane carbamates as muscarinic acetylcholine receptor antagonists. Bioorg Med Chem Lett17:6066-9 (2007) 
 
Muscarinic acetylcholine receptor M3
Name:Muscarinic acetylcholine receptor M3
Type:Enzyme
Mol. Mass.:66151.03
Organism:Homo sapiens (Human)
Description:P20309
Residue:590
BDBM50223990
NameBDBM50223990
Synonyms:8,8-dimethyl-3-(phenyl-thiophen-2-ylmethyl-carbamoyloxy)-8-azonia-bicyclo[3.2.1]octane; bromide | CHEMBL237093
TypeSmall organic molecule
Emp. Form.C21H27N2O2S
Mol. Mass.371.516
SMILESC[N+]1(C)C2CCC1CC(C2)OC(=O)N(Cc1cccs1)c1ccccc1