Reaction Details
TargetMuscarinic acetylcholine receptor M1
LigandBDBM50223994
Substrate/Competitorn/a
Meas. Tech.ChEMBL_450371 (CHEMBL900656)
IC50 13.8±n/a nM
Citation Lainé, DIXie, HBuffet, NFoley, JJBuckley, PWebb, EFWiddowson, KLPalovich, MRBelmonte, KE Discovery of novel 8-azoniabicyclo[3.2.1]octane carbamates as muscarinic acetylcholine receptor antagonists. Bioorg Med Chem Lett17:6066-9 (2007) 
 
Muscarinic acetylcholine receptor M1
Name:Muscarinic acetylcholine receptor M1
Type:Protein
Mol. Mass.:51442.54
Organism:Homo sapiens (Human)
Description:P11229
Residue:460
BDBM50223994
NameBDBM50223994
Synonyms:8-methyl-8-aza-bicyclo[3.2.1]octan-3-yl thiophen-3-yl(thiophen-3-ylmethyl)carbamate | CHEMBL236655
TypeSmall organic molecule
Emp. Form.C18H22N2O2S2
Mol. Mass.362.509
SMILESCN1C2CCC1CC(C2)OC(=O)N(Cc1ccsc1)c1ccsc1