Reaction Details
TargetMuscarinic acetylcholine receptor M1
LigandBDBM50223964
Substrate/Competitorn/a
Meas. Tech.ChEMBL_450371 (CHEMBL900656)
IC50 2.1±n/a nM
Citation Lainé, DIXie, HBuffet, NFoley, JJBuckley, PWebb, EFWiddowson, KLPalovich, MRBelmonte, KE Discovery of novel 8-azoniabicyclo[3.2.1]octane carbamates as muscarinic acetylcholine receptor antagonists. Bioorg Med Chem Lett17:6066-9 (2007) 
 
Muscarinic acetylcholine receptor M1
Name:Muscarinic acetylcholine receptor M1
Type:Protein
Mol. Mass.:51442.54
Organism:Homo sapiens (Human)
Description:P11229
Residue:460
BDBM50223964
NameBDBM50223964
Synonyms:3-(benzyl-thiophen-3-yl-carbamoyloxy)-8,8-dimethyl-8-azonia-bicyclo[3.2.1]octane; bromide | CHEMBL237742
TypeSmall organic molecule
Emp. Form.C21H27N2O2S
Mol. Mass.371.516
SMILESC[N+]1(C)C2CCC1CC(C2)OC(=O)N(Cc1ccccc1)c1ccsc1