Reaction Details
TargetMuscarinic acetylcholine receptor M1
LigandBDBM50223995
Substrate/Competitorn/a
Meas. Tech.ChEMBL_450371 (CHEMBL900656)
IC50 15.8±n/a nM
Citation Lainé, DIXie, HBuffet, NFoley, JJBuckley, PWebb, EFWiddowson, KLPalovich, MRBelmonte, KE Discovery of novel 8-azoniabicyclo[3.2.1]octane carbamates as muscarinic acetylcholine receptor antagonists. Bioorg Med Chem Lett17:6066-9 (2007) 
 
Muscarinic acetylcholine receptor M1
Name:Muscarinic acetylcholine receptor M1
Type:Protein
Mol. Mass.:51442.54
Organism:Homo sapiens (Human)
Description:P11229
Residue:460
BDBM50223995
NameBDBM50223995
Synonyms:8,8-dimethyl-3-[(5-methyl-thiophen-2-ylmethyl)-phenyl-carbamoyloxy]-8-azonia-bicyclo[3.2.1]octane; bromide | CHEMBL237527
TypeSmall organic molecule
Emp. Form.C22H29N2O2S
Mol. Mass.385.542
SMILESCc1ccc(CN(C(=O)OC2CC3CCC(C2)[N+]3(C)C)c2ccccc2)s1