Reaction Details
TargetCannabinoid receptor 2
LigandBDBM50224077
Substrate/Competitorn/a
Meas. Tech.ChEMBL_450409 (CHEMBL900693)
Ki 18.2±n/a nM
Citation Stern, EMuccioli, GGBosier, BHamtiaux, LMillet, RPoupaert, JHHénichart, JPDepreux, PGoossens, JFLambert, DM Pharmacomodulations around the 4-oxo-1,4-dihydroquinoline-3-carboxamides, a class of potent CB2-selective cannabinoid receptor ligands: consequences in receptor affinity and functionality. J Med Chem50:5471-84 (2007) 
 
Cannabinoid receptor 2
Name:Cannabinoid receptor 2
Type:G Protein-Coupled Receptor (GPCR)
Mol. Mass.:39690.94
Organism:Homo sapiens (Human)
Description:P34972
Residue:360
BDBM50224077
NameBDBM50224077
Synonyms:CHEMBL236361 | N3-(1-(3,5-dimethyl)adamantyl)-1-pentyl-4-thioxo-1,4-dihydroquinoline-3-carboxamide
TypeSmall organic molecule
Emp. Form.C27H36N2OS
Mol. Mass.436.653
SMILESCCCCCn1cc(C(=O)NC23CC4CC(C)(CC(C)(C4)C2)C3)c(=S)c2ccccc12