Reaction Details
TargetProstaglandin G/H synthase 2
LigandBDBM50224126
Substrate/Competitorn/a
Meas. Tech.ChEMBL_450439 (CHEMBL900723)
IC50 5400±n/a nM
Citation Biava, MPorretta, GCPoce, GSupino, SForli, SRovini, MCappelli, AManetti, FBotta, MSautebin, LRossi, APergola, CGhelardini, CVivoli, EMakovec, FAnzellotti, PPatrignani, PAnzini, M Cyclooxygenase-2 inhibitors. 1,5-diarylpyrrol-3-acetic esters with enhanced inhibitory activity toward cyclooxygenase-2 and improved cyclooxygenase-2/cyclooxygenase-1 selectivity. J Med Chem50:5403-11 (2007) 
 
Prostaglandin G/H synthase 2
Name:Prostaglandin G/H synthase 2
Type:Protein
Mol. Mass.:69020.39
Organism:Mus musculus (Mouse)
Description:Q05769
Residue:604
BDBM50224126
NameBDBM50224126
Synonyms:CHEMBL398383 | Ehyl-2-methyl-1-[4-(methylsulfonyl)phenyl]-5-[3,4-(difluoro)phenyl]-1H-pyrrol-3-acetate
TypeSmall organic molecule
Emp. Form.C22H21F2NO4S
Mol. Mass.433.468
SMILESCCOC(=O)Cc1cc(-c2ccc(F)c(F)c2)n(c1C)-c1ccc(cc1)S(C)(=O)=O