Reaction Details
TargetHistamine H3 receptor
LigandBDBM50224187
Substrate/Competitorn/a
Meas. Tech.ChEMBL_450591 (CHEMBL900877)
EC50 1.41±n/a nM
Citation Altenbach, RJLiu, HBanfor, PNBrowman, KEFox, GBFryer, RMKomater, VAKrueger, KMMarsh, KMiller, TRPan, JBPan, LSun, MThiffault, CWetter, JZhao, CZhou, DEsbenshade, TAHancock, AACowart, MD Synthesis, potency, and in vivo profiles of quinoline containing histamine H3 receptor inverse agonists. J Med Chem50:5439-48 (2007) 
 
Histamine H3 receptor
Name:Histamine H3 receptor
Type:G Protein-Coupled Receptor (GPCR)
Mol. Mass.:48691.47
Organism:Homo sapiens (Human)
Description:Binding assays were using CHO cells stably expressing hH3R receptors.
Residue:445
BDBM50224187
NameBDBM50224187
Synonyms:(R)-2-(5-methyl-1-(pyridin-2-yl)-1H-pyrazol-4-yl)-6-(2-(2-methylpyrrolidin-1-yl)ethyl)quinoline CHEMBL393581
TypeSmall organic molecule
Emp. Form.C25H27N5
Mol. Mass.397.5154
SMILESC[C@@H]1CCCN1CCc1ccc2nc(ccc2c1)-c1cnn(c1C)-c1ccccn1