Reaction Details
TargetHistamine H3 receptor
LigandBDBM50139391
Substrate/Competitorn/a
Meas. Tech.ChEMBL_450587 (CHEMBL900871)
Ki 1.35±n/a nM
Citation Altenbach, RJLiu, HBanfor, PNBrowman, KEFox, GBFryer, RMKomater, VAKrueger, KMMarsh, KMiller, TRPan, JBPan, LSun, MThiffault, CWetter, JZhao, CZhou, DEsbenshade, TAHancock, AACowart, MD Synthesis, potency, and in vivo profiles of quinoline containing histamine H3 receptor inverse agonists. J Med Chem50:5439-48 (2007) 
 
Histamine H3 receptor
Name:Histamine H3 receptor
Type:G Protein-Coupled Receptor (GPCR)
Mol. Mass.:48607.98
Organism:Rattus norvegicus (rat)
Description:n/a
Residue:445
BDBM50139391
NameBDBM50139391
Synonyms:(R)-4-(2-(2-(2-methylpyrrolidin-1-yl)ethyl)benzofuran-5-yl)benzonitrile ABT-239 | CHEMBL351231
TypeSmall organic molecule
Emp. Form.C22H22N2O
Mol. Mass.330.4229
SMILESC[C@@H]1CCCN1CCc1cc2cc(ccc2o1)-c1ccc(cc1)C#N