Reaction Details
TargetTransient receptor potential cation channel subfamily V member 1
LigandBDBM50160039
Substrate/Competitorn/a
Meas. Tech.ChEMBL_450654 (CHEMBL900937)
IC50 37±n/a nM
Citation Tanaka, HShishido, Y Synthesis of aromatic compounds containing a 1,1-dialkyl-2-trifluoromethyl group, a bioisostere of the tert-alkyl moiety. Bioorg Med Chem Lett17:6079-85 (2007) 
 
Transient receptor potential cation channel subfamily V member 1
Name:Transient receptor potential cation channel subfamily V member 1
Type:Protein
Mol. Mass.:94960.75
Organism:Homo sapiens (Human)
Description:Q8NER1
Residue:839
BDBM50160039
NameBDBM50160039
Synonyms:CHEMBL183752 N-(4-tert-butylphenyl)-4-(3-chloropyridin-2-yl)benzamide
TypeSmall organic molecule
Emp. Form.C22H21ClN2O
Mol. Mass.364.868
SMILESCC(C)(C)c1ccc(NC(=O)c2ccc(cc2)-c2ncccc2Cl)cc1