Reaction Details
TargetTransient receptor potential cation channel subfamily V member 1
LigandBDBM50224199
Substrate/Competitorn/a
Meas. Tech.ChEMBL_450654 (CHEMBL900937)
IC50 42±n/a nM
Citation Tanaka, HShishido, Y Synthesis of aromatic compounds containing a 1,1-dialkyl-2-trifluoromethyl group, a bioisostere of the tert-alkyl moiety. Bioorg Med Chem Lett17:6079-85 (2007) 
 
Transient receptor potential cation channel subfamily V member 1
Name:Transient receptor potential cation channel subfamily V member 1
Type:Protein
Mol. Mass.:94960.75
Organism:Homo sapiens (Human)
Description:Q8NER1
Residue:839
BDBM50224199
NameBDBM50224199
Synonyms:4-(3-chloropyridin-2-yl)-N-(4-(1,1,1-trifluoro-2-methylpropan-2-yl)phenyl)benzamide | CHEMBL238016
TypeSmall organic molecule
Emp. Form.C22H18ClF3N2O
Mol. Mass.418.839
SMILESCC(C)(c1ccc(NC(=O)c2ccc(cc2)-c2ncccc2Cl)cc1)C(F)(F)F