Reaction Details
TargetSubstance-P receptor
LigandBDBM50224198
Substrate/Competitorn/a
Meas. Tech.ChEMBL_450653 (CHEMBL900936)
IC50 0.300000±n/a nM
Citation Tanaka, HShishido, Y Synthesis of aromatic compounds containing a 1,1-dialkyl-2-trifluoromethyl group, a bioisostere of the tert-alkyl moiety. Bioorg Med Chem Lett17:6079-85 (2007) 
 
Substance-P receptor
Name:Substance-P receptor
Type:G Protein-Coupled Receptor (GPCR)
Mol. Mass.:46254.43
Organism:Homo sapiens (Human)
Description:P25103
Residue:407
BDBM50224198
NameBDBM50224198
Synonyms:(2S,3S)-N-(2-methoxy-5-(1,1,1-trifluoro-2-methylpropan-2-yl)benzyl)-2-phenylpiperidin-3-amine CHEMBL392368
TypeSmall organic molecule
Emp. Form.C23H29F3N2O
Mol. Mass.406.4844
SMILESCOc1ccc(cc1CN[C@H]1CCCN[C@H]1c1ccccc1)C(C)(C)C(F)(F)F