Reaction Details
Target11-beta-hydroxysteroid dehydrogenase 1
LigandBDBM50224217
Substrate/Competitorn/a
Meas. Tech.ChEMBL_450657 (CHEMBL900940)
IC50 28±n/a nM
Citation Yuan, CSt Jean, DJLiu, QCai, LLi, AHan, NMoniz, GAskew, BHungate, RWJohansson, LTedenborg, LPyring, DWilliams, MHale, CChen, MCupples, RZhang, JJordan, SBartberger, MDSun, YEmery, MWang, MFotsch, C The discovery of 2-anilinothiazolones as 11beta-HSD1 inhibitors. Bioorg Med Chem Lett17:6056-61 (2007) 
 
11-beta-hydroxysteroid dehydrogenase 1
Name:11-beta-hydroxysteroid dehydrogenase 1
Type:Enzyme
Mol. Mass.:32409.16
Organism:Homo sapiens (Human)
Description:P28845
Residue:292
BDBM50224217
NameBDBM50224217
Synonyms:2-(2,5-difluorophenylamino)-5-isopropylthiazol-4(5H)-one | CHEMBL236174
TypeSmall organic molecule
Emp. Form.C12H12F2N2OS
Mol. Mass.270.298
SMILESCC(C)c1sc(Nc2cc(F)ccc2F)nc1O