Reaction Details
Target11-beta-hydroxysteroid dehydrogenase 1
LigandBDBM50224210
Substrate/Competitorn/a
Meas. Tech.ChEMBL_450656 (CHEMBL900939)
Ki 660±n/a nM
Citation Yuan, CSt Jean, DJLiu, QCai, LLi, AHan, NMoniz, GAskew, BHungate, RWJohansson, LTedenborg, LPyring, DWilliams, MHale, CChen, MCupples, RZhang, JJordan, SBartberger, MDSun, YEmery, MWang, MFotsch, C The discovery of 2-anilinothiazolones as 11beta-HSD1 inhibitors. Bioorg Med Chem Lett17:6056-61 (2007) 
 
11-beta-hydroxysteroid dehydrogenase 1
Name:11-beta-hydroxysteroid dehydrogenase 1
Type:Enzyme
Mol. Mass.:32409.16
Organism:Homo sapiens (Human)
Description:P28845
Residue:292
BDBM50224210
NameBDBM50224210
Synonyms:2-(4-cyclohexylphenylamino)-5-isopropylthiazol-4(5H)-one | CHEMBL237463
TypeSmall organic molecule
Emp. Form.C18H24N2OS
Mol. Mass.316.461
SMILESCC(C)c1sc(Nc2ccc(cc2)C2CCCCC2)nc1O