Reaction Details
Target11-beta-hydroxysteroid dehydrogenase 1
LigandBDBM50224221
Substrate/Competitorn/a
Meas. Tech.ChEMBL_450656 (CHEMBL900939)
Ki 5.3±n/a nM
Citation Yuan, CSt Jean, DJLiu, QCai, LLi, AHan, NMoniz, GAskew, BHungate, RWJohansson, LTedenborg, LPyring, DWilliams, MHale, CChen, MCupples, RZhang, JJordan, SBartberger, MDSun, YEmery, MWang, MFotsch, C The discovery of 2-anilinothiazolones as 11beta-HSD1 inhibitors. Bioorg Med Chem Lett17:6056-61 (2007) 
 
11-beta-hydroxysteroid dehydrogenase 1
Name:11-beta-hydroxysteroid dehydrogenase 1
Type:Enzyme
Mol. Mass.:32409.16
Organism:Homo sapiens (Human)
Description:P28845
Residue:292
BDBM50224221
NameBDBM50224221
Synonyms:5-cyclopentyl-2-(2-fluorophenylamino)thiazol-4(5H)-one | CHEMBL240269
TypeSmall organic molecule
Emp. Form.C14H15FN2OS
Mol. Mass.278.345
SMILESOc1nc(Nc2ccccc2F)sc1C1CCCC1