Reaction Details
TargetProto-oncogene tyrosine-protein kinase Src
LigandBDBM50224375
Substrate/Competitorn/a
Meas. Tech.ChEMBL_450769 (CHEMBL899855)
Ki 25000±n/a nM
Citation Manetti, FSantucci, ALocatelli, GAMaga, GSpreafico, ASerchi, TOrlandini, MBernardini, GCaradonna, NPSpallarossa, ABrullo, CSchenone, SBruno, ORanise, ABondavalli, FHoffmann, OBologna, MAngelucci, ABotta, M Identification of a novel pyrazolo[3,4-d]pyrimidine able to inhibit cell proliferation of a human osteogenic sarcoma in vitro and in a xenograft model in mice. J Med Chem50:5579-88 (2007) 
 
Proto-oncogene tyrosine-protein kinase Src
Name:Proto-oncogene tyrosine-protein kinase Src
Type:Protein
Mol. Mass.:59838.60
Organism:Homo sapiens (Human)
Description:P12931
Residue:536
BDBM50224375
NameBDBM50224375
Synonyms:CHEMBL401038 | N-(4-chlorophenethyl)-7-(2-chloro-2-phenylethyl)-2-(methylthio)-7H-pyrrolo[2,3-d]pyrimidin-4-amine
TypeSmall organic molecule
Emp. Form.C23H22Cl2N4S
Mol. Mass.457.419
SMILESCSc1nc(NCCc2ccc(Cl)cc2)c2ccn(CC(Cl)c3ccccc3)c2n1