Reaction Details
TargetProto-oncogene tyrosine-protein kinase Src
LigandBDBM50224381
Substrate/Competitorn/a
Meas. Tech.ChEMBL_450769 (CHEMBL899855)
Ki 1400±n/a nM
Citation Manetti, FSantucci, ALocatelli, GAMaga, GSpreafico, ASerchi, TOrlandini, MBernardini, GCaradonna, NPSpallarossa, ABrullo, CSchenone, SBruno, ORanise, ABondavalli, FHoffmann, OBologna, MAngelucci, ABotta, M Identification of a novel pyrazolo[3,4-d]pyrimidine able to inhibit cell proliferation of a human osteogenic sarcoma in vitro and in a xenograft model in mice. J Med Chem50:5579-88 (2007) 
 
Proto-oncogene tyrosine-protein kinase Src
Name:Proto-oncogene tyrosine-protein kinase Src
Type:Protein
Mol. Mass.:59838.60
Organism:Homo sapiens (Human)
Description:P12931
Residue:536
BDBM50224381
NameBDBM50224381
Synonyms:1-(2-chloro-2-phenylethyl)-N-(3-fluorophenyl)-6-(methylthio)-1H-pyrazolo[3,4-d]pyrimidin-4-amine | CHEMBL238559
TypeSmall organic molecule
Emp. Form.C20H17ClFN5S
Mol. Mass.413.899
SMILESCSc1nc(Nc2cccc(F)c2)c2cnn(CC(Cl)c3ccccc3)c2n1