Reaction Details
TargetProto-oncogene tyrosine-protein kinase Src
LigandBDBM50142887
Substrate/Competitorn/a
Meas. Tech.ChEMBL_450769 (CHEMBL899855)
Ki 500±n/a nM
Citation Manetti, FSantucci, ALocatelli, GAMaga, GSpreafico, ASerchi, TOrlandini, MBernardini, GCaradonna, NPSpallarossa, ABrullo, CSchenone, SBruno, ORanise, ABondavalli, FHoffmann, OBologna, MAngelucci, ABotta, M Identification of a novel pyrazolo[3,4-d]pyrimidine able to inhibit cell proliferation of a human osteogenic sarcoma in vitro and in a xenograft model in mice. J Med Chem50:5579-88 (2007) 
 
Proto-oncogene tyrosine-protein kinase Src
Name:Proto-oncogene tyrosine-protein kinase Src
Type:Protein
Mol. Mass.:59838.60
Organism:Homo sapiens (Human)
Description:P12931
Residue:536
BDBM50142887
NameBDBM50142887
Synonyms:1-(tert-butyl)-3-(4-chlorophenyl)-4-aminopyrazolo[3,4-d]pyrimidine 1-tert-butyl-3-(4-chlorophenyl)-1H-pyrazolo[3,4-d]pyrimidin-4-amine 4-amino-5-(4-chlorophenyl)-7-(tert-butyl)pyrazolo[3,4-d]pyrimidine CHEMBL406845 US10544104, Compound 146 US11701353, PP2 (Pfizer) cid_4878
TypeSmall organic molecule
Emp. Form.C15H16ClN5
Mol. Mass.301.774
SMILESCC(C)(C)n1nc(-c2ccc(Cl)cc2)c2c(N)ncnc12