Reaction Details
TargetMetabotropic glutamate receptor 1
LigandBDBM50224405
Substrate/Competitorn/a
Meas. Tech.ChEMBL_450777 (CHEMBL899862)
Ki 1±n/a nM
Citation Wu, WLBurnett, DADomalski, MGreenlee, WJLi, CBertorelli, RFredduzzi, SLozza, GVeltri, AReggiani, A Discovery of orally efficacious tetracyclic metabotropic glutamate receptor 1 (mGluR1) antagonists for the treatment of chronic pain. J Med Chem50:5550-3 (2007) 
 
Metabotropic glutamate receptor 1
Name:Metabotropic glutamate receptor 1
Type:Enzyme Catalytic Domain
Mol. Mass.:133240.47
Organism:RAT
Description:metabotropic glutamate 1/2 0 RAT::P23385
Residue:1199
BDBM50224405
NameBDBM50224405
Synonyms:2,3-dihydro-9-(4-methoxyphenyl)-1H-pyrimido[4'',5'':4',5']thieno[3',2':5,6]pyrido[3,4-b][1,4]oxazin-8(9H)-one | CHEMBL393922
TypeSmall organic molecule
Emp. Form.C18H14N4O3S
Mol. Mass.366.394
SMILESCOc1ccc(cc1)-n1cnc2c(sc3ncc4OCCNc4c23)c1=O