Reaction Details
TargetCalcitonin gene-related peptide type 1 receptor
LigandBDBM50224426
Substrate/Competitorn/a
Meas. Tech.ChEMBL_450786 (CHEMBL899871)
IC50 1±n/a nM
Citation Paone, DVShaw, AWNguyen, DNBurgey, CSDeng, JZKane, SAKoblan, KSSalvatore, CAMosser, SDJohnston, VKWong, BKMiller-Stein, CMHershey, JCGraham, SLVacca, JPWilliams, TM Potent, orally bioavailable calcitonin gene-related peptide receptor antagonists for the treatment of migraine: discovery of N-[(3R,6S)-6-(2,3-difluorophenyl)-2-oxo-1- (2,2,2-trifluoroethyl)azepan-3-yl]-4- (2-oxo-2,3-dihydro-1H-imidazo[4,5-b]pyridin- 1-yl)piperidine-1-carboxamide (MK-0974). J Med Chem50:5564-7 (2007) 
 
Calcitonin gene-related peptide type 1 receptor
Name:Calcitonin gene-related peptide type 1 receptor
Type:Enzyme Catalytic Domain
Mol. Mass.:52980.45
Organism:Homo sapiens (Human)
Description:Q16602
Residue:461
BDBM50224426
NameBDBM50224426
Synonyms:CHEMBL238276 | N-{(3R,6S)-6-(2,3-difluorophenyl)-2-oxo-1-[2-(trifluoromethoxy)ethyl]azepan-3-yl}-4-(2-oxo-2,3-dihydro-1H-imidazo[4,5-b]pyridin-1-yl)piperidine-1-carboxamide
TypeSmall organic molecule
Emp. Form.C27H29F5N6O4
Mol. Mass.596.549
SMILESFc1cccc([C@@H]2CC[C@@H](NC(=O)N3CCC(CC3)n3c4cccnc4[nH]c3=O)C(=O)N(CCOC(F)(F)F)C2)c1F