Reaction Details
TargetC-C chemokine receptor type 2
LigandBDBM50224512
Substrate/Competitorn/a
Meas. Tech.ChEMBL_450803 (CHEMBL899888)
IC50 10±n/a nM
Citation Xia, MHou, CDeMong, DEPollack, SRPan, MBrackley, JAJain, NGerchak, CSinger, MMalaviya, RMatheis, MOlini, GCavender, DWachter, M Synthesis, structure-activity relationship and in vivo antiinflammatory efficacy of substituted dipiperidines as CCR2 antagonists. J Med Chem50:5561-3 (2007) 
 
C-C chemokine receptor type 2
Name:C-C chemokine receptor type 2
Type:Enzyme
Mol. Mass.:41932.32
Organism:Homo sapiens (Human)
Description:P41597
Residue:374
BDBM50224512
NameBDBM50224512
Synonyms:2-(1-((4-(trifluoromethoxy)phenyl)carbamoyl)piperidin-4-yl)-2-(4-(1H-indol-3-yl)piperidin-1-yl)acetic acid | CHEMBL237754
TypeSmall organic molecule
Emp. Form.C28H31F3N4O4
Mol. Mass.544.5653
SMILESOC(=O)C(C1CCN(CC1)C(=O)Nc1ccc(OC(F)(F)F)cc1)N1CCC(CC1)c1c[nH]c2ccccc12