Reaction Details
TargetCoagulation factor X
LigandBDBM50224700
Substrate/Competitorn/a
Meas. Tech.ChEMBL_458333 (CHEMBL941667)
Ki 6.9±n/a nM
Citation Varnes, JGWacker, DAJacobson, ICQuan, MLEllis, CDRossi, KAHe, MYLuettgen, JMKnabb, RMBai, SHe, KLam, PYWexler, RR Design, structure-activity relationship, and pharmacokinetic profile of pyrazole-based indoline factor Xa inhibitors. Bioorg Med Chem Lett17:6481-8 (2007) 
 
Coagulation factor X
Name:Coagulation factor X
Type:Enzyme
Mol. Mass.:54726.60
Organism:Homo sapiens (Human)
Description:n/a
Residue:488
BDBM50224700
NameBDBM50224700
Synonyms:1-(3-aminobenzo[d]isoxazol-5-yl)-5-(5-(2-((N-methylmethan-3-ylsulfonamido)methyl)-1H-imidazol-1-yl)indoline-1-carbonyl)-1H-pyrazole-3-carboxamide | CHEMBL398979
TypeSmall organic molecule
Emp. Form.C26H25N9O5S
Mol. Mass.575.599
SMILESCN(Cc1nccn1-c1ccc2N(CCc2c1)C(=O)c1cc(nn1-c1ccc2onc(N)c2c1)C(N)=O)S(C)(=O)=O