Reaction Details
TargetCoagulation factor X
LigandBDBM50224703
Substrate/Competitorn/a
Meas. Tech.ChEMBL_458333 (CHEMBL941667)
Ki 6.8±n/a nM
Citation Varnes, JGWacker, DAJacobson, ICQuan, MLEllis, CDRossi, KAHe, MYLuettgen, JMKnabb, RMBai, SHe, KLam, PYWexler, RR Design, structure-activity relationship, and pharmacokinetic profile of pyrazole-based indoline factor Xa inhibitors. Bioorg Med Chem Lett17:6481-8 (2007) 
 
Coagulation factor X
Name:Coagulation factor X
Type:Enzyme
Mol. Mass.:54726.60
Organism:Homo sapiens (Human)
Description:n/a
Residue:488
BDBM50224703
NameBDBM50224703
Synonyms:1-(3-aminobenzo[d]isoxazol-5-yl)-5-(5-(2-(dimethylamino)-N-methylacetamido)indoline-1-carbonyl)-1H-pyrazole-3-carboxamide | CHEMBL399722
TypeSmall organic molecule
Emp. Form.C25H26N8O4
Mol. Mass.502.5251
SMILESCN(C)CC(=O)N(C)c1ccc2N(CCc2c1)C(=O)c1cc(nn1-c1ccc2onc(N)c2c1)C(N)=O