Reaction Details
TargetCoagulation factor X
LigandBDBM50224711
Substrate/Competitorn/a
Meas. Tech.ChEMBL_458333 (CHEMBL941667)
Ki 0.82±n/a nM
Citation Varnes, JGWacker, DAJacobson, ICQuan, MLEllis, CDRossi, KAHe, MYLuettgen, JMKnabb, RMBai, SHe, KLam, PYWexler, RR Design, structure-activity relationship, and pharmacokinetic profile of pyrazole-based indoline factor Xa inhibitors. Bioorg Med Chem Lett17:6481-8 (2007) 
 
Coagulation factor X
Name:Coagulation factor X
Type:Enzyme
Mol. Mass.:54726.60
Organism:Homo sapiens (Human)
Description:n/a
Residue:488
BDBM50224711
NameBDBM50224711
Synonyms:1-(3-aminobenzo[d]isoxazol-5-yl)-5-(5-(2-(methylsulfonyl)phenyl)indoline-1-carbonyl)-1H-pyrazole-3-carboxamide | CHEMBL248724
TypeSmall organic molecule
Emp. Form.C27H22N6O5S
Mol. Mass.542.566
SMILESCS(=O)(=O)c1ccccc1-c1ccc2N(CCc2c1)C(=O)c1cc(nn1-c1ccc2onc(N)c2c1)C(N)=O