Reaction Details
TargetCoagulation factor X
LigandBDBM50224712
Substrate/Competitorn/a
Meas. Tech.ChEMBL_458333 (CHEMBL941667)
Ki 0.2±n/a nM
Citation Varnes, JGWacker, DAJacobson, ICQuan, MLEllis, CDRossi, KAHe, MYLuettgen, JMKnabb, RMBai, SHe, KLam, PYWexler, RR Design, structure-activity relationship, and pharmacokinetic profile of pyrazole-based indoline factor Xa inhibitors. Bioorg Med Chem Lett17:6481-8 (2007) 
 
Coagulation factor X
Name:Coagulation factor X
Type:Enzyme
Mol. Mass.:54726.60
Organism:Homo sapiens (Human)
Description:n/a
Residue:488
BDBM50224712
NameBDBM50224712
Synonyms:1-(3-aminobenzo[d]isoxazol-5-yl)-5-(5-(2-oxopyridin-1(2H)-yl)indoline-1-carbonyl)-1H-pyrazole-3-carboxamide | CHEMBL399345
TypeSmall organic molecule
Emp. Form.C25H19N7O4
Mol. Mass.481.4629
SMILESNC(=O)c1cc(C(=O)N2CCc3cc(ccc23)-n2ccccc2=O)n(n1)-c1ccc2onc(N)c2c1