Reaction Details
TargetUrotensin-2 receptor
LigandBDBM50224727
Substrate/Competitorn/a
Meas. Tech.ChEMBL_450869 (CHEMBL899955)
Ki 30±n/a nM
Citation Luci, DKGhosh, SSmith, CEQi, JWang, YHaertlein, BParry, TJLi, JAlmond, HRMinor, LKDamiano, BPKinney, WAMaryanoff, BELawson, EC Phenylpiperidine-benzoxazinones as urotensin-II receptor antagonists: synthesis, SAR, and in vivo assessment. Bioorg Med Chem Lett17:6489-92 (2007) 
 
Urotensin-2 receptor
Name:Urotensin-2 receptor
Type:Enzyme Catalytic Domain
Mol. Mass.:42159.71
Organism:Homo sapiens (Human)
Description:Urotensin-II UTS2R HUMAN::Q9UKP6
Residue:389
BDBM50224727
NameBDBM50224727
Synonyms:CHEMBL239199 | N-benzyl-4-((5-chloro-2-(1-(2-(3-oxo-2,3-dihydrobenzo[b][1,4]oxazin-4-yl)ethyl)piperidin-4-yl)benzamido)methyl)piperidine-1-carboxamide
TypeSmall organic molecule
Emp. Form.C36H42ClN5O4
Mol. Mass.644.203
SMILESClc1ccc(C2CCN(CCN3C(=O)COc4ccccc34)CC2)c(c1)C(=O)NCC1CCN(CC1)C(=O)NCc1ccccc1