Reaction Details
TargetUrotensin-2 receptor
LigandBDBM50224717
Substrate/Competitorn/a
Meas. Tech.ChEMBL_450869 (CHEMBL899955)
Ki 27±n/a nM
Citation Luci, DKGhosh, SSmith, CEQi, JWang, YHaertlein, BParry, TJLi, JAlmond, HRMinor, LKDamiano, BPKinney, WAMaryanoff, BELawson, EC Phenylpiperidine-benzoxazinones as urotensin-II receptor antagonists: synthesis, SAR, and in vivo assessment. Bioorg Med Chem Lett17:6489-92 (2007) 
 
Urotensin-2 receptor
Name:Urotensin-2 receptor
Type:Enzyme Catalytic Domain
Mol. Mass.:42159.71
Organism:Homo sapiens (Human)
Description:Urotensin-II UTS2R HUMAN::Q9UKP6
Residue:389
BDBM50224717
NameBDBM50224717
Synonyms:5-chloro-N-((1-(3,3-dimethylbutanoyl)piperidin-4-yl)methyl)-2-(1-(2-(3-oxo-2,3-dihydrobenzo[b][1,4]oxazin-4-yl)ethyl)piperidin-4-yl)benzamide | CHEMBL237879
TypeSmall organic molecule
Emp. Form.C34H45ClN4O4
Mol. Mass.609.199
SMILESCC(C)(C)CC(=O)N1CCC(CNC(=O)c2cc(Cl)ccc2C2CCN(CCN3C(=O)COc4ccccc34)CC2)CC1