Reaction Details
TargetAurora kinase B
LigandBDBM50224734
Substrate/Competitorn/a
Meas. Tech.ChEMBL_450878 (CHEMBL899964)
IC50 198±n/a nM
Citation Bavetsias, VSun, CBouloc, NReynisson, JWorkman, PLinardopoulos, SMcDonald, E Hit generation and exploration: imidazo[4,5-b]pyridine derivatives as inhibitors of Aurora kinases. Bioorg Med Chem Lett17:6567-71 (2007) 
 
Aurora kinase B
Name:Aurora kinase B
Type:Protein
Mol. Mass.:39327.72
Organism:Homo sapiens (Human)
Description:Q96GD4
Residue:344
BDBM50224734
NameBDBM50224734
Synonyms:2-(4-(6-Chloro-2-(4-(dimethylamino)phenyl)-3H-imidazo[4,5-b]-pyridin-7-yl)piperazin-1-yl)-N-(thiazol-2-yl)acetamide CHEMBL392525
TypeSmall organic molecule
Emp. Form.C23H25ClN8OS
Mol. Mass.497.016
SMILESCN(C)c1ccc(cc1)-c1nc2ncc(Cl)c(N3CCN(CC(=O)Nc4nccs4)CC3)c2[nH]1