Reaction Details
TargetAurora kinase A
LigandBDBM50224736
Substrate/Competitorn/a
Meas. Tech.ChEMBL_450875 (CHEMBL899962)
IC50 4600±n/a nM
Citation Bavetsias, VSun, CBouloc, NReynisson, JWorkman, PLinardopoulos, SMcDonald, E Hit generation and exploration: imidazo[4,5-b]pyridine derivatives as inhibitors of Aurora kinases. Bioorg Med Chem Lett17:6567-71 (2007) 
 
Aurora kinase A
Name:Aurora kinase A
Type:Serine/threonine-protein kinase
Mol. Mass.:45830.98
Organism:Homo sapiens (Human)
Description:O14965
Residue:403
BDBM50224736
NameBDBM50224736
Synonyms:2-(4-(pyrrolidin-1-yl)phenyl)-3H-imidazo[4,5-b]pyridine | CHEMBL236938
TypeSmall organic molecule
Emp. Form.C16H16N4
Mol. Mass.264.325
SMILESC1CCN(C1)c1ccc(cc1)-c1nc2ncccc2[nH]1