Reaction Details
TargetAurora kinase A
LigandBDBM50224741
Substrate/Competitorn/a
Meas. Tech.ChEMBL_450875 (CHEMBL899962)
IC50 25000±n/a nM
Citation Bavetsias, VSun, CBouloc, NReynisson, JWorkman, PLinardopoulos, SMcDonald, E Hit generation and exploration: imidazo[4,5-b]pyridine derivatives as inhibitors of Aurora kinases. Bioorg Med Chem Lett17:6567-71 (2007) 
 
Aurora kinase A
Name:Aurora kinase A
Type:Serine/threonine-protein kinase
Mol. Mass.:45830.98
Organism:Homo sapiens (Human)
Description:O14965
Residue:403
BDBM50224741
NameBDBM50224741
Synonyms:6,7-dimethoxy-4-(4-(1-phenylethyl)piperazin-1-yl)quinazoline | CHEMBL236693
TypeSmall organic molecule
Emp. Form.C22H26N4O2
Mol. Mass.378.4674
SMILESCOc1cc2ncnc(N3CCN(CC3)C(C)c3ccccc3)c2cc1OC