Reaction Details
TargetAurora kinase A
LigandBDBM50224755
Substrate/Competitorn/a
Meas. Tech.ChEMBL_450875 (CHEMBL899962)
IC50 35000±n/a nM
Citation Bavetsias, VSun, CBouloc, NReynisson, JWorkman, PLinardopoulos, SMcDonald, E Hit generation and exploration: imidazo[4,5-b]pyridine derivatives as inhibitors of Aurora kinases. Bioorg Med Chem Lett17:6567-71 (2007) 
 
Aurora kinase A
Name:Aurora kinase A
Type:Serine/threonine-protein kinase
Mol. Mass.:45830.98
Organism:Homo sapiens (Human)
Description:O14965
Residue:403
BDBM50224755
NameBDBM50224755
Synonyms:6,7-dimethoxy-4-(4-(2-phenoxyethyl)piperazin-1-yl)quinazoline | CHEMBL236691
TypeSmall organic molecule
Emp. Form.C22H26N4O3
Mol. Mass.394.4668
SMILESCOc1cc2ncnc(N3CCN(CCOc4ccccc4)CC3)c2cc1OC