Reaction Details
TargetCollagenase 3
LigandBDBM50194289
Substrate/Competitorn/a
Meas. Tech.ChEMBL_458357 (CHEMBL941691)
IC50 0.68±n/a nM
Citation Freeman-Cook, KDReiter, LANoe, MCAntipas, ASDanley, DEDatta, KDowns, JTEisenbeis, SEskra, JDGarmene, DJGreer, EMGriffiths, RJGuzman, RHardink, JRJanat, FJones, CSMartinelli, GJMitchell, PGLaird, ERLiras, JLLopresti-Morrow, LLPandit, JReilly, UDRobertson, DVaughn-Bowser, MLWolf-Gouviea, LAYocum, SA Potent, selective spiropyrrolidine pyrimidinetrione inhibitors of MMP-13. Bioorg Med Chem Lett17:6529-34 (2007) 
 
Collagenase 3
Name:Collagenase 3
Type:Enzyme
Mol. Mass.:53808.06
Organism:Homo sapiens (Human)
Description:P45452
Residue:471
BDBM50194289
NameBDBM50194289
Synonyms:5-(2-ethoxy-ethyl)-5-(4-{4-[4-(4-fluoro-phenyl)-oxazol-2-yl]-phenoxy}-phenoxy)-pyrimidine-2,4,6-trione CHEMBL220957
TypeSmall organic molecule
Emp. Form.C29H24FN3O7
Mol. Mass.545.5152
SMILESCCOCCC1(Oc2ccc(Oc3ccc(cc3)-c3nc(co3)-c3ccc(F)cc3)cc2)C(=O)NC(=O)NC1=O