Reaction Details
TargetCollagenase 3
LigandBDBM50224845
Substrate/Competitorn/a
Meas. Tech.ChEMBL_458357 (CHEMBL941691)
IC50 0.4±n/a nM
Citation Freeman-Cook, KDReiter, LANoe, MCAntipas, ASDanley, DEDatta, KDowns, JTEisenbeis, SEskra, JDGarmene, DJGreer, EMGriffiths, RJGuzman, RHardink, JRJanat, FJones, CSMartinelli, GJMitchell, PGLaird, ERLiras, JLLopresti-Morrow, LLPandit, JReilly, UDRobertson, DVaughn-Bowser, MLWolf-Gouviea, LAYocum, SA Potent, selective spiropyrrolidine pyrimidinetrione inhibitors of MMP-13. Bioorg Med Chem Lett17:6529-34 (2007) 
 
Collagenase 3
Name:Collagenase 3
Type:Enzyme
Mol. Mass.:53808.06
Organism:Homo sapiens (Human)
Description:P45452
Residue:471
BDBM50224845
NameBDBM50224845
Synonyms:5-(2-ethoxyethyl)-5-(4-(4-(6-fluoro-1H-benzo[d]imidazol-2-yl)phenoxy)phenoxy)pyrimidine-2,4,6(1H,3H,5H)-trione | CHEMBL250554
TypeSmall organic molecule
Emp. Form.C27H23FN4O6
Mol. Mass.518.4931
SMILESCCOCCC1(Oc2ccc(Oc3ccc(cc3)-c3nc4ccc(F)cc4[nH]3)cc2)C(=O)NC(=O)NC1=O