Reaction Details
TargetCollagenase 3
LigandBDBM50224844
Substrate/Competitorn/a
Meas. Tech.ChEMBL_458357 (CHEMBL941691)
IC50 1.57±n/a nM
Citation Freeman-Cook, KDReiter, LANoe, MCAntipas, ASDanley, DEDatta, KDowns, JTEisenbeis, SEskra, JDGarmene, DJGreer, EMGriffiths, RJGuzman, RHardink, JRJanat, FJones, CSMartinelli, GJMitchell, PGLaird, ERLiras, JLLopresti-Morrow, LLPandit, JReilly, UDRobertson, DVaughn-Bowser, MLWolf-Gouviea, LAYocum, SA Potent, selective spiropyrrolidine pyrimidinetrione inhibitors of MMP-13. Bioorg Med Chem Lett17:6529-34 (2007) 
 
Collagenase 3
Name:Collagenase 3
Type:Enzyme
Mol. Mass.:53808.06
Organism:Homo sapiens (Human)
Description:P45452
Residue:471
BDBM50224844
NameBDBM50224844
Synonyms:1-[6-(4-fluoro-phenoxy)-pyridin-3-yl]-1,7,9-triaza-spiro[4.5]decane-6,8,10-trione | CHEMBL398966
TypeSmall organic molecule
Emp. Form.C18H15FN4O4
Mol. Mass.370.3345
SMILESFc1ccc(Oc2ccc(cn2)N2CCCC22C(=O)NC(=O)NC2=O)cc1