Reaction Details
TargetCollagenase 3
LigandBDBM50194304
Substrate/Competitorn/a
Meas. Tech.ChEMBL_458357 (CHEMBL941691)
IC50 0.52±n/a nM
Citation Freeman-Cook, KDReiter, LANoe, MCAntipas, ASDanley, DEDatta, KDowns, JTEisenbeis, SEskra, JDGarmene, DJGreer, EMGriffiths, RJGuzman, RHardink, JRJanat, FJones, CSMartinelli, GJMitchell, PGLaird, ERLiras, JLLopresti-Morrow, LLPandit, JReilly, UDRobertson, DVaughn-Bowser, MLWolf-Gouviea, LAYocum, SA Potent, selective spiropyrrolidine pyrimidinetrione inhibitors of MMP-13. Bioorg Med Chem Lett17:6529-34 (2007) 
 
Collagenase 3
Name:Collagenase 3
Type:Enzyme
Mol. Mass.:53808.06
Organism:Homo sapiens (Human)
Description:P45452
Residue:471
BDBM50194304
NameBDBM50194304
Synonyms:3-(2-(4-(4-(5-(2-ethoxyethyl)-2,4,6-trioxo-hexahydropyrimidin-5-yloxy)phenoxy)phenyl)oxazol-4-yl)benzonitrile | CHEMBL221632
TypeSmall organic molecule
Emp. Form.C30H24N4O7
Mol. Mass.552.5342
SMILESCCOCCC1(Oc2ccc(Oc3ccc(cc3)-c3nc(co3)-c3cccc(c3)C#N)cc2)C(=O)NC(=O)NC1=O