Reaction Details
TargetMetabotropic glutamate receptor 5
LigandBDBM50224920
Substrate/Competitorn/a
Meas. Tech.ChEMBL_450923 (CHEMBL900011)
IC50 6.19±n/a nM
Citation Galatsis, PYamagata, KWendt, JAConnolly, CJMickelson, JWMilbank, JBBove, SEKnauer, CSBrooker, RMAugelli-Szafran, CESchwarz, RDKinsora, JJKilgore, KS Synthesis and SAR comparison of regioisomeric aryl naphthyridines as potent mGlu5 receptor antagonists. Bioorg Med Chem Lett17:6525-8 (2007) 
 
Metabotropic glutamate receptor 5
Name:Metabotropic glutamate receptor 5
Type:Enzyme
Mol. Mass.:131900.14
Organism:Rattus norvegicus (Rat)
Description:P31424
Residue:1203
BDBM50224920
NameBDBM50224920
Synonyms:3-methoxy-5-(2-methyl-1,6-naphthyridin-7-yl)benzonitrile | CHEMBL238346
TypeSmall organic molecule
Emp. Form.C17H13N3O
Mol. Mass.275.3046
SMILESCOc1cc(cc(c1)-c1cc2nc(C)ccc2cn1)C#N